{"text_format":"1","workbook":"xlsx","n_sheets":4,"sheets":["grade","torneios","consulta","banco"],"not_rendered":{"charts":0,"images":0,"macros":1,"external_links":0,"defined_names":0,"comments":0,"pivot_tables":0},"unopened":[],"bounds":{"document_bytes":16777216,"sheet_cells":100000,"rows_first":2000,"rows_last":500,"rows_between":2000,"halvings":0,"cell_chars":16384,"cell_head_chars":4096},"cells_cut":0,"cells_raw":0,"read":"whole","date_system":"1900"}

{"sheet":"grade","index":0,"n_rows":186,"n_cols":14,"rows_kept":186,"cut":false,"hidden":false,"merged":[[1,10,1,12],[2,10,2,12],[0,10,0,12],[0,1,0,3],[1,1,1,3],[2,1,2,3],[0,5,0,7],[1,5,1,7]]}
["buy-ins",{"$f":"SUMPRODUCT(D:D,E:E)+SUMPRODUCT(K:K,L:L)","v":0},null,null,null,"Saldo inicial",null,null,1000,null,"Buy-in médio ideal",null,null,4.6100000000000003]
["prêmios",{"$f":"SUM(F:F,M:M)","v":0},null,null,null,"Saldo Atual",null,null,{"$f":"I1+B3","v":1000},null,"Número de torneios",null,null,{"$f":"SUM(E:E,L:L)","v":0}]
["saldo",{"$f":"-B1+B2","v":0},null,null,null,null,null,null,null,null,"Buy-in médio atual",null,null,{"$f":"IFERROR(B1/N2,0)","v":0}]
[]
["Torneio","hora","late","buyin","n","prêmios","Site",null,"Sit & Go","dura","buyin","n","prêmios","Site"]
["Bounty Builder $3.30, $1K Gtd [T]","on-D","on-D",3.3,null,null,"PS",null,"$1.00 [180 Players]",240,1,null,null,"PS"]
["Saturday Micro $8K Gtd","08:00:00","08:00:00",3.3,null,null,"PS",null,"$1.00 [45 Players]",140,1,null,null,"PS"]
["Mini Daily Kickoff, $8K Gtd","08:00:00","08:00:00",11,null,null,"PS",null,"$1.50 [18 Players]",60,1.5,null,null,"PS"]
["Big $27, $4K Gtd","08:00:00","08:00:00",27,null,null,"PS",null,"$1.50 NL Hold'em [9 Players]",85,1.5,null,null,"PS"]
["Hot $4.40, $3K Gtd [T]","08:15:00","08:15:00",4.4000000000000004,null,null,"PS",null,"$1.50  [9 Players, HYPER]",22,1.5,null,null,"PS"]
["Bounty Builder $7.50, $12K Gtd","08:30:00","08:30:00",7.5,null,null,"PS",null,"$1.50 [9 Players, TURBO]",48,1.5,null,null,"PS"]
["Big $44 Sat [Deep], 3 Seats Gtd","08:31:00","08:31:00",4.4000000000000004,null,null,"PS",null,"$1.50 KO [90 Players]",240,1.5,null,null,"PS"]
["PKO Rumble 16.5 - Sat [HypT]","08:32:00","08:32:00",2.2000000000000002,null,null,888,null,"$2.50 [180 Players] [TURBO]",115,2.5,null,null,"PS"]
["$2,000 Voyage 5.50","08:45:00","08:45:00",5.5,null,null,888,null,"$3.00 KO [9 Players]",65,3,null,null,"PS"]
["$2,000 PKO","09:00:00","09:00:00",33,null,null,888,null,"$3.50 [18 Players]",90,3.5,null,null,"PS"]
["Bounty Hunter $11 $1.5K Gtd","09:00:00","09:00:00",11,null,null,"PP",null,"$3.50 [18 Players] [TURBO]",60,3.5,null,null,"PS"]
["Classic $27 $1.5K Gtd","09:00:00","09:00:00",27,null,null,"PP",null,"$3.50 [45 Players]",145,3.5,null,null,"PS"]
["Big $4.40, $5K Gtd","09:00:00","09:00:00",4.4000000000000004,null,null,"PS",null,"$3.50 [45 Players] [TURBO]",85,3.5,null,null,"PS"]
["Deepstack $5.5 $1K Gtd","09:15:00","09:15:00",5.5,null,null,"PP",null,"$3.50 [9 Players, HYPER]",22,3.5,null,null,"PS"]
["The Magnum Sat: 5 x $44 Gtd","09:15:00","09:15:00",5.5,null,null,"PP",null,"$3.50 [9 Players, TURBO]",48,3.5,null,null,"PS"]
["Bounty Hunter $3.3 $500 Gtd","09:30:00","09:30:00",3.3,null,null,"PP",null,"$4.50 [36 - 180 Players]",240,4.5,null,null,"PS"]
["The Grind Sat: 3 x $33 Gtd","09:30:00","09:30:00",3.3,null,null,"PP",null,"satelite [HYPER]",10,0.15,null,null,"PS"]
["Bounty Hunter $22 $2K Gtd","09:30:00","09:30:00",22,null,null,"PP"]
["Mini Daily Marathon, $8K Gtd [Slow]","09:30:00","09:30:00",5.5,null,null,"PS"]
["Bounty Builder $16.50, $25K Gtd","09:30:00","09:30:00",16.5,null,null,"PS"]
["Bounty Builder $44 Sat [Deep]","09:32:00","09:32:00",4.4000000000000004,null,null,"PS"]
["The Spartan Sat: 7 x $16.5 Gtd","09:45:00","09:45:00",2.2000000000000002,null,null,"PP"]
["The Predator Sat: 5 x $22 Gtd","09:45:00","09:45:00",2.2000000000000002,null,null,"PP"]
["$2K Gtd","09:45:00","09:45:00",5.5,null,null,"PS"]
["Deep Stacks, $2K Gtd [8-Max]","10:00:00","10:00:00",7.5,null,null,"PS"]
["Super $22 Sat: 10 x $22 Gtd","10:00:00","10:00:00",3.3,null,null,"PP"]
["Bounty Hunter $7.5 $2.5K Gtd","10:00:00","10:00:00",7.5,null,null,"PP"]
["The Grind Sat: 3 x $33 Gtd","10:15:00","10:15:00",3.3,null,null,"PP"]
["The Magnum Sat: 5 x $44 Gtd","10:15:00","10:15:00",5.5,null,null,"PP"]
["Progressive KO, $5K Gtd","10:20:00","10:20:00",5.5,null,null,"PS"]
["Deep Stacks, $2K Gtd","10:25:00","10:25:00",27,null,null,"PS"]
["$5,000 PKO Rumble 16.5","10:30:00","10:30:00",16.5,null,null,888]
["The Spartan Sat: 7 x $16.5 Gtd","10:30:00","10:30:00",2.2000000000000002,null,null,"PP"]
["Bounty Hunter $3.3 $500 Gtd","10:30:00","10:30:00",3.3,null,null,"PP"]
["Bounty Hunter $33 $2K Gtd","10:30:00","10:30:00",33,null,null,"PP"]
["$3,000 Big Shot 5.50","10:45:00","10:45:00",5.5,null,null,888]
["The Masters Sat: 3 x $55 Gtd","10:45:00","10:45:00",5.5,null,null,"PP"]
["Big $7.50, $8K Gtd","11:00:00","11:00:00",7.5,null,null,"PS"]
["$800 Deepstack","11:00:00","11:00:00",3.3,null,null,888]
["The Grind Sat: 3 x $33 Gtd","11:00:00","11:00:00",3.3,null,null,"PP"]
["Super $22 Sat: 10 x $22 Gtd","11:00:00","11:00:00",3.3,null,null,"PP"]
["Bounty Hunter $22 $2K Gtd","11:00:00","11:00:00",22,null,null,"PP"]
["DeepStacks $5.5: $1.5K Gtd","11:05:00","11:05:00",5.5,null,null,"PP"]
["The Grind $33 $7.5K Gtd","11:05:00","11:05:00",33,null,null,"PP"]
["The Magnum Sat: 5 x $44 Gtd","11:15:00","11:15:00",5.5,null,null,"PP"]
["600 Player Cap, $1K Gtd","11:15:00","11:15:00",3.3,null,null,"PS"]
["Hot $5.50, $10K Gtd [T]","11:15:00","11:15:00",5.5,null,null,"PS"]
["The Masters Sat: 3 x $55 Gtd","11:30:00","11:30:00",5.5,null,null,"PP"]
["The Spartan $16.5 $10K Gtd","11:30:00","11:30:00",16.5,null,null,"PP"]
["Bounty Builder $5.50, $18K Gtd","11:30:00","11:30:00",5.5,null,null,"PS"]
["Big $33 Sat [T], Deep Stacks","11:31:00","11:31:00",3.3,null,null,"PS"]
["PKO Rumble 22 - Sat [HypT]","11:33:00","11:33:00",3.3,null,null,888]
["$2,000 Voyage 8.80","11:45:00","11:45:00",8.8000000000000007,null,null,888]
["Progressive KO, $6K Gtd","11:45:00","11:45:00",7.5,null,null,"PS"]
["$10,000 Big Shot 33","12:00:00","12:00:00",33,null,null,888]
{"$rows_left_out":127}
{"sheet":"torneios","index":1,"n_rows":421,"n_cols":6,"rows_kept":421,"cut":false,"hidden":false,"merged":[]}
["Início","Buy-in","Velocidade","Nome","Rebuy","Site"]
["00:00:00",16.5,"Regular","Big $16.50, $2.5K Gtd",null,"PS"]
["00:05:00",4.4000000000000004,"Regular","Progressive KO, $1.5K Gtd",null,"PS"]
["00:15:00",3.3,"Turbo","Hot $3.30, $1K Gtd",null,"PS"]
["00:30:00",22,"Regular","Bounty Builder $22, $10K Gtd",null,"PS"]
["00:32:00",2.2000000000000002,"Turbo","Bounty Builder $22 Sat [Deep], 5 Seats Gtd",null,"PS"]
["01:00:00",2.2000000000000002,"Regular","Big $2.20, $1K Gtd",null,"PS"]
["01:00:00",3.3,"Turbo","Progressive KO, $1K Gtd",null,"PS"]
["01:15:00",11,"Regular","Progressive KO, Deep Stacks, $3K Gtd",null,"PS"]
["01:15:00",22,"Turbo","Hot $22, $2.5K Gtd",null,"PS"]
["01:30:00",5.5,"Regular","Bounty Builder $5.50, $4K Gtd",null,"PS"]
["02:00:00",3.3,"Regular","Early Battle Mega Sat, 2 Seats Gtd",null,"PS"]
["02:00:00",3.3,"Turbo","Progressive KO, $1K Gtd",null,"PS"]
["02:00:00",16.5,"Regular","Mini Daily Pacific Rim Special, $10K Gtd",null,"PS"]
["02:00:00",33,"Regular","Big $33, $2K Gtd",null,"PS"]
["02:10:00",5.5,"Regular","Deep Stacks, $1K Gtd",null,"PS"]
["02:15:00",2.2000000000000002,"Turbo","Hot $2.20 [Progressive KO], $1K Gtd",null,"PS"]
["02:30:00",2.2000000000000002,"Regular","$500 Gtd",null,"PS"]
["02:30:00",22,"Regular","Bounty Builder $22, $8K Gtd",null,"PS"]
["02:32:00",7.5,"Turbo","Bounty Builder $82 Sat [Deep], 5 Seats Gtd",null,"PS"]
["02:40:00",16.5,"Turbo","$1.5K Gtd",null,"PS"]
["03:00:00",1.1000000000000001,"Turbo","30% Progressive KO, $500 Gtd",null,"PS"]
["03:14:00",2.2000000000000002,"Turbo","Big $11 Sat, 5 Seats Gtd",null,"PS"]
["03:20:00",7.5,"Regular","Progressive KO, Deep Stacks, $2K Gtd",null,"PS"]
["03:25:00",11,"Turbo","$1K Gtd",null,"PS"]
["03:30:00",3.3,"Regular","Bounty Builder $3.30, $4K Gtd",null,"PS"]
["03:32:00",1.1000000000000001,"Turbo","Bounty Builder $11 Sat [Deep], 10 Seats Gtd",null,"PS"]
["03:32:00",11,"Turbo","Bounty Builder $109 Sat [Deep], 5 Seats Gtd",null,"PS"]
["04:00:00",0.55000000000000004,"Regular","Mini Battle Royale [Early Edition] Mega Sat, 5 Seats Gtd",null,"PS"]
["04:00:00",0.55000000000000004,"Regular","Mini Saturday Knockout [Early Edition] Mega Sat, 10 Seats Gtd",null,"PS"]
["04:00:00",1.1000000000000001,"Regular","Mini Fast Friday [Early Edition] Mega Sat, 3 Seats Gtd",null,"PS"]
["04:00:00",1.1000000000000001,"Regular","Mini Thursday Thrill [Early Edition] Mega Sat, 3 Seats Gtd",null,"PS"]
["04:00:00",5.5,"Regular","Battle Royale [Early Edition] Mega Sat, 2 Seats Gtd",null,"PS"]
["04:00:00",5.5,"Regular","Saturday Knockout [Early Edition] Mega Sat, 2 Seats Gtd",null,"PS"]
["04:00:00",7.5,"Regular","Fast Friday [Early Edition] Mega Sat, 2 Seats Gtd",null,"PS"]
["04:00:00",11,"Regular","Big $11, $3K Gtd",null,"PS"]
["04:00:00",11,"Regular","Thursday Thrill [Early Edition] Mega Sat, 2 Seats Gtd",null,"PS"]
["04:15:00",7.5,"Turbo","Hot $7.50 [Progressive KO], $3K Gtd",null,"PS"]
["04:20:00",2.2000000000000002,"Turbo","Progressive KO, $1K Gtd",null,"PS"]
["04:32:00",4.4000000000000004,"Turbo","Bounty Builder $44 Sat [Deep], 5 Seats Gtd",null,"PS"]
["04:46:00",1.1000000000000001,"Turbo","Battle Royale [Early Edition] Sat [Splash], 1 Seat Gtd","Sim","PS"]
["04:46:00",1.1000000000000001,"Turbo","Fast Friday [Early Edition] Sat [Splash], 1 Seat Gtd","Sim","PS"]
["04:46:00",1.1000000000000001,"Turbo","Saturday Knockout [Early Edition] Sat [Splash], 1 Seat Gtd","Sim","PS"]
["05:00:00",4.4000000000000004,"Turbo","Progressive KO, $1.5K Gtd",null,"PS"]
["05:00:00",22,"Regular","Big $22, $4K Gtd",null,"PS"]
["05:14:00",11,"Turbo","Battle Royale [Early Edition] Sat [Deep], 3 Seats Gtd",null,"PS"]
["05:14:00",11,"Turbo","Fast Friday [Early Edition] Sat [Deep], 2 Seats Gtd",null,"PS"]
["05:14:00",11,"Turbo","Saturday Knockout [Early Edition] Sat [Deep], 3 Seats Gtd",null,"PS"]
["05:14:00",22,"Turbo","Thursday Thrill [Early Edition] Sat [Deep], 2 Seats Gtd",null,"PS"]
["05:15:00",1.1000000000000001,"Turbo","Mini Battle Royale [Early Edition] Sat [Deep], 5 Seats Gtd",null,"PS"]
["05:15:00",1.1000000000000001,"Turbo","Mini Fast Friday [Early Edition] Sat [Deep], 3 Seats Gtd",null,"PS"]
["05:15:00",1.1000000000000001,"Turbo","Mini Saturday Knockout [Early Edition] Sat [Deep], 10 Seats Gtd",null,"PS"]
["05:15:00",2.2000000000000002,"Turbo","Mini Thursday Thrill [Early Edition] Sat [Deep], 5 Seats Gtd",null,"PS"]
["05:15:00",7.5,"Regular","Deep Stacks, $1K Gtd",null,"PS"]
["05:15:00",27,"Turbo","Hot $27 [Progressive KO], $4K Gtd",null,"PS"]
["05:20:00",1.1000000000000001,"Regular","$750 Gtd","Sim","PS"]
["05:25:00",33,"Regular","Progressive KO, Deep Stacks, $2K Gtd",null,"PS"]
["05:29:00",16.5,"Regular","Battle Royale [Early Edition] Sat [Deep], 3 Seats Gtd",null,"PS"]
["05:29:00",16.5,"Regular","Fast Friday [Early Edition] Sat [Deep], 2 Seats Gtd",null,"PS"]
["05:29:00",16.5,"Regular","Saturday Knockout [Early Edition] Sat [Deep], 3 Seats Gtd",null,"PS"]
{"$rows_left_out":362}
{"sheet":"consulta","index":2,"n_rows":41,"n_cols":10,"rows_kept":41,"cut":false,"hidden":false,"merged":[[1,1,1,2],[1,4,1,5],[10,1,10,2]]}
[]
[null,"Sit & Go",null,null,"MTT",null,null,"1 dólar =",5,"reais"]
[null,"jogadores",18,null,"jogadores",1500]
[null,"ROI",0.1,null,"ROI",0.2]
[null,"chance de quebrar",0.1,null,"chance de quebrar",0.1]
[null,"Buy-in",7,null,"Buy-in",4.606027137525361]
[]
[null,"Bankroll",{"$f":"ROUND(C6*IF(banco!Q6=banco!Q7,banco!P6,banco!P7+((banco!Q7-C4)/(banco!Q7-banco!Q6))*(banco!P6-banco!P7)),2)","v":295.7},null,"Bankroll",{"$f":"ROUND(F6*IF(banco!Q14=banco!Q15,banco!P14,banco!P15+((banco!Q15-F4)/(banco!Q15-banco!Q14))*(banco!P14-banco!P15)),2)","v":1000}]
[null,null,{"$f":"C8*$I$2","v":1478.5},null,null,{"$f":"F8*$I$2","v":5000}]
[]
[null,"Renda mensal"]
[null,"Dias por mês",8]
[null,"ROI",0.25]
[null,"Torneios por dia",30]
[null,"Buy-in médio",11]
[]
[null,"Torneios por mês",{"$f":"C14*C12","v":240}]
[null,"Renda",{"$f":"C15*C13*C14*C12","v":660}]
[null,null,{"$f":"C18*$I$2","v":3300}]
[]
[]
[]
[]
[]
[]
[]
[]
[]
[]
[]
[]
[null,"mesas","horas","horas","por dia","dias/mês","por mês","AVG BI","Lucro"]
[null,4,2,6,{"$f":"D33*B33/C33","v":12},12,{"$f":"F33*E33","v":144},2.5,{"$f":"\"$ \"&H33*#REF!*G33","v":{"$error":"#REF!"}}]
[null,8,2,5,{"$f":"D34*B34/C34","v":20},12,{"$f":"F34*E34","v":240},2.5,{"$f":"\"$ \"&H34*#REF!*G34","v":{"$error":"#REF!"}}]
[null,16,2,6,{"$f":"D35*B35/C35","v":48},12,{"$f":"F35*E35","v":576},2.5,{"$f":"\"$ \"&H35*#REF!*G35","v":{"$error":"#REF!"}}]
[]
[]
[]
[null,"torneios","ROI","BI","lucro"]
[null,400,-0.15,40,{"$f":"D40*C40*B40","v":-2400}]
[null,1000,0.35,5.5,{"$f":"D41*C41*B41","v":1924.9999999999998}]

{"sheet":"banco","index":3,"n_rows":109,"n_cols":19,"rows_kept":109,"cut":false,"hidden":true,"merged":[]}
["field","roi",0,0.01,0.05,0.1,null,"field","roi",0,0.01,0.05,0.1]
[300,0,592.25629090909115,315.56161963636396,227.91636000000037,184.31947636363651,null,9,0,{"$f":"1.2*J3","v":106.84710857142761},{"$f":"1.2*K3","v":52.846688685714092},{"$f":"1.2*L3","v":34.616026285713971},{"$f":"1.2*M3","v":26.540287999999862},null,null,"Contas auxiliares Sit"]
[300,0.05,493.54690909090931,262.96801636363665,189.9303000000003,153.59956363636377,null,9,0.1,89.039257142856343,44.038907238095078,28.846688571428309,22.116906666666551,null,null,{"$f":"MATCH(consulta!C3,banco!H1:H35,0)","v":9},"field"]
[300,0.1,411.2890909090911,219.1400136363639,158.27525000000026,127.99963636363648,null,9,0.2,{"$f":"0.63*J3","v":56.094731999999496},{"$f":"0.63*K3","v":27.7445115599999},{"$f":"0.63*L3","v":18.173413799999835},{"$f":"0.63*M3","v":13.933651199999927},null,null,{"$f":"MATCH(consulta!C4,banco!I2:I7,1)","v":2},"ROI"]
[300,0.15,331.2154545454548,183.78476363636392,129.97338636363651,103.05154545454556,null,9,0.3,{"$f":"0.73*J4","v":40.949154359999632},{"$f":"0.73*K4","v":20.253493438799925},{"$f":"0.73*L4","v":13.266592073999879},{"$f":"0.73*M4","v":10.171565375999947},null,null,{"$f":"MATCH(consulta!C5,banco!J1:M1,0)","v":4},"chance de quebrar"]
[300,0.2,306.1395454545459,153.20315000000011,105.15613636363645,81.997363636363815,null,9,0.4,{"$f":"0.74*J5","v":30.302374226399728},{"$f":"0.74*K5","v":14.987585144711945},{"$f":"0.74*L5","v":9.8172781347599098},{"$f":"0.74*M5","v":7.5269583782399607},null,null,{"$f":"INDIRECT(\"banco!L\"&banco!P3+banco!P4-1&\"C\"&9+banco!P5,consulta!LB32)","v":42.242533333333093},{"$f":"INDIRECT(\"banco!L\"&banco!P3+banco!P4-1&\"C9\",consulta!LB32)","v":0.1},"inferior"]
[300,0.25,302.41090909090934,127.33197272727297,86.120727272727521,66.806727272727301,null,9,0.5,{"$f":"0.8*J6","v":24.241899381119783},{"$f":"0.8*K6","v":11.990068115769557},{"$f":"0.8*L6","v":7.8538225078079282},{"$f":"0.8*M6","v":6.0215667025919686},null,null,{"$f":"INDIRECT(\"banco!L\"&banco!P3+banco!P4&\"C\"&9+banco!P5,consulta!LB32)","v":26.61279599999985},{"$f":"INDIRECT(\"banco!L\"&banco!P3+banco!P4&\"C9\",consulta!LB32)","v":0.2},"superior"]
[300,0.3,213.85590909090951,108.766490909091,72.639931818181935,55.486409090909149,null,9,0.5,24.241899381119783,11.990068115769557,7.8538225078079282,6.0215667025919686]
[300,0.35,171.0847272727276,87.013192727272809,58.111945454545548,44.389127272727322,null,18,0,{"$f":"1.2*J10","v":178.36257142857065},{"$f":"1.2*K10","v":96.536825142856699},{"$f":"1.2*L10","v":65.032399999999726},{"$f":"1.2*M10","v":50.69103999999971}]
[300,0.4,136.8677818181821,69.610554181818245,46.489556363636439,35.511301818181856,null,18,0.1,148.63547619047554,80.447354285713914,54.193666666666438,42.242533333333093,null,null,"Contas auxiliares MTT"]
[300,0.45,109.49422545454568,55.688443345454601,37.191645090909155,28.409041454545488,null,18,0.2,{"$f":"0.63*J10","v":93.6403499999996},{"$f":"0.63*K10","v":50.681833199999765},{"$f":"0.63*L10","v":34.142009999999857},{"$f":"0.63*M10","v":26.61279599999985},null,null,{"$f":"MATCH(consulta!F3,banco!A2:A109,1)-10","v":38},"field"]
[300,0.5,87.595380363636551,44.550754676363681,29.753316072727326,22.727233163636392,null,18,0.3,{"$f":"0.73*J11","v":68.357455499999702},{"$f":"0.73*K11","v":36.997738235999826},{"$f":"0.73*L11","v":24.923667299999895},{"$f":"0.73*M11","v":19.427341079999891},null,null,{"$f":"MATCH(consulta!F4,banco!B2:B12,1)","v":5},"ROI"]
[300,0.5,87.595380363636551,44.550754676363681,29.753316072727326,22.727233163636392,null,18,0.4,{"$f":"0.74*J12","v":50.584517069999777},{"$f":"0.74*K12","v":27.378326294639869},{"$f":"0.74*L12","v":18.443513801999924},{"$f":"0.74*M12","v":14.376232399199919},null,null,{"$f":"MATCH(consulta!F5,banco!C1:F1,0)","v":4},"chance de quebrar"]
[500,0,642.28516363636368,398.90554036363648,299.17269818181859,247.64328000000012,null,18,0.5,{"$f":"0.8*J13","v":40.467613655999827},{"$f":"0.8*K13","v":21.902661035711898},{"$f":"0.8*L13","v":14.75481104159994},{"$f":"0.8*M13","v":11.500985919359936},null,null,{"$f":"IF(Q$16=15000,P16,banco!P16+((consulta!F$3-banco!Q16)/(banco!Q18-banco!Q16))*(banco!P18-banco!P16))","v":217.10645454545414},{"$f":"INDIRECT(\"banco!L\"&banco!P11+banco!P12-1&\"C2\",consulta!LB20)","v":0.2},"inferior"]
[500,0.05,535.2376363636364,332.42128363636374,249.31058181818216,206.3694000000001,null,18,0.5,40.467613655999827,21.902661035711898,14.75481104159994,11.500985919359936,null,null,{"$f":"IF(Q$16=15000,P17,banco!P17+((consulta!F$3-banco!Q17)/(banco!Q19-banco!Q17))*(banco!P19-banco!P17))","v":191.92486363636331},{"$f":"INDIRECT(\"banco!L\"&banco!P11+banco!P12&\"C2\",consulta!LB20)","v":0.25},"superior"]
[500,0.1,446.03136363636372,277.01773636363646,207.75881818181847,171.97450000000009,null,45,0,{"$f":"1.2*J17","v":280.8},{"$f":"1.2*K17","v":154.79999999999998},{"$f":"1.2*L17","v":108},{"$f":"1.2*M17","v":85.2},null,null,{"$f":"INDIRECT(\"banco!L\"&banco!P11+banco!P12-1&\"C\"&2+banco!P13,consulta!LB20)","v":217.10645454545414},{"$f":"INDIRECT(\"banco!L\"&banco!P11+banco!P12-1&\"C1\",consulta!LB20)","v":1500},{"$f":"INDIRECT(\"banco!L\"&banco!P11+banco!P12-1&\"C2\",consulta!LB20)","v":0.2},"field abaixo"]
[500,0.15,408.0468181818182,247.43874545454551,180.29690909090954,144.45363636363706,null,45,0.1,234,129,90,71,null,null,{"$f":"INDIRECT(\"banco!L\"&banco!P11+banco!P12&\"C\"&2+banco!P13,consulta!LB20)","v":191.92486363636331},{"$f":"INDIRECT(\"banco!L\"&banco!P11+banco!P12&\"C1\",consulta!LB20)","v":1500},{"$f":"INDIRECT(\"banco!L\"&banco!P11+banco!P12&\"C2\",consulta!LB20)","v":0.25},"field abaixo"]
[500,0.2,410.5827272727272,212.12616363636369,149.13261363636377,117.37445454545477,null,45,0.2,155.75000000000068,84.440800000001332,54.432500000000459,42.282000000000494,null,null,{"$f":"INDIRECT(\"banco!L\"&banco!P11+banco!P12-1+12&\"C\"&2+banco!P13,consulta!LB20)","v":264.55622727272726},{"$f":"INDIRECT(\"banco!L\"&banco!P11+banco!P12-1+12&\"C1\",consulta!LB20)","v":2000},{"$f":"INDIRECT(\"banco!L\"&banco!P11+banco!P12-1+12&\"C2\",consulta!LB20)","v":0.2},"field acima"]
[500,0.25,366.44363636363653,183.58802272727303,126.36840909090952,98.212636363636619,null,45,0.3,130.37000000000148,58.073700000000372,37.681500000000142,28.992000000000303,null,null,{"$f":"INDIRECT(\"banco!L\"&banco!P11+banco!P12+12&\"C\"&2+banco!P13,consulta!LB20)","v":235.40040909090908},{"$f":"INDIRECT(\"banco!L\"&banco!P11+banco!P12+12&\"C1\",consulta!LB20)","v":2000},{"$f":"INDIRECT(\"banco!L\"&banco!P11+banco!P12+12&\"C2\",consulta!LB20)","v":0.25},"field acima"]
[500,0.3,312.11636363636376,156.02475909090924,106.54800000000061,83.070363636363822,null,45,0.4,94.190000000001419,43.740100000000439,28.140499999999975,21.641000000000076]
[500,0.35,249.69309090909101,124.8198072727274,85.238400000000496,66.456290909091067,null,45,0.5,{"$f":"0.8*J19","v":104.29600000000119},{"$f":"0.8*K19","v":46.458960000000303},{"$f":"0.8*L19","v":30.145200000000116},{"$f":"0.8*M19","v":23.193600000000245}]
[500,0.4,199.75447272727283,99.855845818181933,68.190720000000397,53.165032727272859,null,45,0.5,104.29600000000119,46.458960000000303,30.145200000000116,23.193600000000245]
[500,0.45,159.80357818181827,79.884676654545558,54.552576000000322,42.532026181818289,null,90,0,{"$f":"1.2*J24","v":297.35999999999439},{"$f":"1.2*K24","v":179.76899999999463},{"$f":"1.2*L24","v":126.04939999999392},{"$f":"1.2*M24","v":99.339999999996451}]
[500,0.5,127.84286254545462,63.907741323636451,43.642060800000259,34.025620945454634,null,90,0.1,247.79999999999535,149.80749999999554,105.04116666666161,82.783333333330376]
[500,0.5,127.84286254545462,63.907741323636451,43.642060800000259,34.025620945454634,null,90,0.2,{"$f":"0.63*J24","v":156.11399999999708},{"$f":"0.63*K24","v":94.378724999997189},{"$f":"0.63*L24","v":66.175934999996812},{"$f":"0.63*M24","v":52.153499999998139}]
[1000,0,732.64058181818211,491.42192072727289,383.54629090909134,319.68248727272766,null,90,0.3,{"$f":"0.73*J25","v":113.96321999999786},{"$f":"0.73*K25","v":68.896469249997949},{"$f":"0.73*L25","v":48.308432549997669},{"$f":"0.73*M25","v":38.072054999998642}]
[1000,0.05,610.53381818181845,409.51826727272743,319.62190909090947,266.40207272727304,null,90,0.4,{"$f":"0.74*J26","v":84.332782799998412},{"$f":"0.74*K26","v":50.983387244998482},{"$f":"0.74*L26","v":35.748240086998273},{"$f":"0.74*M26","v":28.173320699998996}]
[1000,0.1,508.77818181818202,341.26522272727289,266.35159090909121,222.00172727272752,null,90,0.5,{"$f":"0.8*J26","v":91.170575999998292},{"$f":"0.8*K26","v":55.117175399998359},{"$f":"0.8*L26","v":38.646746039998135},{"$f":"0.8*M26","v":30.457643999998915}]
[1000,0.15,497.93500000000017,311.42930000000035,233.12077272727305,191.48322727272765,null,90,0.5,91.170575999998292,55.117175399998359,38.646746039998135,30.457643999998915]
[1000,0.2,445.32909090909112,278.27968636363676,202.0685909090912,164.23450000000025,null,180,0,{"$f":"1.2*J31","v":503.44799999999896},{"$f":"1.2*K31","v":320.8102799999993},{"$f":"1.2*L31","v":235.99379999999923},{"$f":"1.2*M31","v":194.04119999999961}]
[1000,0.25,420.28045454545475,244.9796636363638,174.80115909090921,140.12400000000014,null,180,0.1,419.53999999999917,267.34189999999944,196.66149999999936,161.70099999999968]
[1000,0.3,389.78681818181826,215.68229090909119,151.72304545454597,118.26777272727293,null,180,0.2,{"$f":"0.63*J31","v":264.3101999999995},{"$f":"0.63*K31","v":168.42539699999966},{"$f":"0.63*L31","v":123.8967449999996},{"$f":"0.63*M31","v":101.8716299999998}]
[1000,0.35,311.82945454545461,172.54583272727297,121.37843636363678,94.614218181818345,null,180,0.3,{"$f":"0.73*J32","v":192.94644599999964},{"$f":"0.73*K32","v":122.95053980999975},{"$f":"0.73*L32","v":90.444623849999701},{"$f":"0.73*M32","v":74.366289899999856}]
[1000,0.4,249.46356363636369,138.03666618181839,97.102749090909427,75.691374545454678,null,180,0.4,{"$f":"0.74*J33","v":142.78037003999972},{"$f":"0.74*K33","v":90.98339945939982},{"$f":"0.74*L33","v":66.929021648999779},{"$f":"0.74*M33","v":55.031054525999892}]
[1000,0.45,199.57085090909095,110.42933294545472,77.682199272727544,60.553099636363747,null,180,0.5,{"$f":"0.8*J34","v":114.22429603199978},{"$f":"0.8*K34","v":72.786719567519853},{"$f":"0.8*L34","v":53.543217319199826},{"$f":"0.8*M34","v":44.024843620799913}]
[1000,0.5,159.65668072727277,88.343466356363777,62.145759418182038,48.442479709091003,null,180,0.5,114.22429603199978,72.786719567519853,53.543217319199826,44.024843620799913]
[1000,0.5,159.65668072727277,88.343466356363777,62.145759418182038,48.442479709091003]
[1500,0,850.18516363636354,591.70131490909068,472.73380363636346,399.6035999999994]
[1500,0.05,708.48763636363628,493.08442909090888,393.94483636363623,333.00299999999953]
[1500,0.1,590.40636363636361,410.90369090909076,328.28736363636352,277.5024999999996]
[1500,0.15,565.79272727272701,380.94217272727235,292.99943181818134,244.94004545454499]
[1500,0.2,504.38681818181777,348.55374545454504,263.97318181818144,217.10645454545414]
[1500,0.25,512.25090909090886,317.52211818181792,236.45445454545433,191.92486363636331]
[1500,0.3,494.18727272727256,292.07863636363606,208.29786363636336,166.58727272727214]
[1500,0.35,395.34981818181808,233.66290909090887,166.6382909090907,133.26981818181773]
[1500,0.4,316.2798545454545,186.93032727272711,133.31063272727258,106.61585454545418]
[1500,0.45,253.02388363636362,149.5442618181817,106.64850618181806,85.29268363636335]
[1500,0.5,202.41910690909091,119.63540945454537,85.31880494545446,68.234146909090683]
[1500,0.5,202.41910690909091,119.63540945454537,85.31880494545446,68.234146909090683]
[2000,0,943.8473454545458,680.8312145454546,547.16347636363639,465.48477818181846]
[2000,0.05,786.53945454545487,567.35934545454552,455.96956363636372,387.90398181818205]
[2000,0.1,655.44954545454573,472.79945454545464,379.97463636363642,323.25331818181837]
[2000,0.15,615.3404545454548,440.59046363636372,346.75438636363657,294.57081818181825]
[2000,0.2,573.87318181818205,412.09388181818196,319.26147727272735,264.55622727272726]
[2000,0.25,574.44181818181823,382.16204545454565,287.88279545454571,235.40040909090908]
[2000,0.3,549.99181818181842,350.9906954545458,260.39006818181844,214.18595454545462]
[2000,0.35,439.99345454545477,280.79255636363666,208.31205454545477,171.34876363636371]
[2000,0.4,351.99476363636381,224.63404509090935,166.64964363636383,137.07901090909098]
[2000,0.45,281.59581090909109,179.70723607272748,133.31971490909106,109.66320872727279]
[2000,0.5,225.27664872727289,143.76578885818199,106.65577192727285,87.730566981818242]
{"$rows_left_out":49}